{"text_format":"1","workbook":"xlsx","n_sheets":15,"sheets":["README","Project Information and TOC","General Considerations","General & Pertinent Data","Hydrology & Hydraulics","Geology Seismicity Geotechnical","Structural","Other","Permitting","Construction","Project Specific Sections","Agency Specific Sections","References","Comment Tracking","OPTIONBOX"],"not_rendered":{"charts":0,"images":5,"macros":1,"external_links":0,"defined_names":30,"comments":0,"pivot_tables":0},"unopened":[],"bounds":{"document_bytes":16777216,"sheet_cells":100000,"rows_first":2000,"rows_last":500,"rows_between":2000,"halvings":0,"cell_chars":16384,"cell_head_chars":4096},"cells_cut":0,"cells_raw":0,"read":"whole","date_system":"1900"}

{"sheet":"README","index":0,"n_rows":28,"n_cols":5,"rows_kept":28,"cut":false,"hidden":false,"merged":[[2,3,3,3],[3,1,8,1]]}
[null,"Design Report Review Toolbox","Version:","01"]
[]
[null,"Disclaimer:",null,"Begin"]
[null,"This design report review toolbox is for general information only. The intent is to provide a checklist and guidance on some key work items expected to be included in a design report for dam construction based on the experience of the authors and the review board, comprised of Dam Design Engineers and State Dam Safety Officials, and has been prepared in accordance with generally recognized engineering principles and practices. The toolbox is not intended to be a comprehensive or inclusive list of all items that need to be included in a design report for dam construction. The information presented should not be used without first securing competent advice from qualified professionals with respect to its suitability for any general or specific application.  Regardless of completion of the checklist, generating a complete design report remains the responsibility of the responsible Design Engineer.  No reference made in this publication constitutes an endorsement or warranty thereof by AECOM or sponsors of this Toolbox. Anyone using the information presented in this Toolbox assumes all liability arising from such use."]
[]
[null,null,null,"Developed by: ","AECOM-Denver"]
[]
[null,null,null,"Developed using:","Microsoft Excel 365, Version 2008 (Build 13127.21064 Click-to-Run)"]
[]
[]
{"$rows_left_out":19}
{"sheet":"Project Information and TOC","index":1,"n_rows":111,"n_cols":3,"rows_kept":111,"cut":false,"hidden":false,"merged":[[65,1,65,2],[27,1,27,2],[0,0,1,1],[0,4,1,4],[36,1,36,2],[50,1,50,2]]}
[]
[]
[null,"Dam Name/ID: ","Dam Name"]
[null,"Project Name: ","Project Name"]
[null,"Date:","xx/xx/20xx"]
[null,"Owner:","Dam Owner"]
[null,"Engineer:","Engineer"]
[null,"Completion Status:",1]
[null,"Reviewer (s):","Reviewers"]
[null,"Description/Comments:","Version 01 released June 2021"]
{"$rows_left_out":102}
{"sheet":"General Considerations","index":2,"n_rows":20,"n_cols":8,"rows_kept":20,"cut":false,"hidden":false,"merged":[[3,0,3,7]]}
[null,{"$f":"'Project Information and TOC'!B3","v":"Dam Name/ID: "},{"$f":"IF(ISBLANK('Project Information and TOC'!C3),\"\",'Project Information and TOC'!C3)","v":"Dam Name"},null,{"$f":"'Project Information and TOC'!B6","v":"Owner:"},{"$f":"'Project Information and TOC'!C6","v":"Dam Owner"}]
[null,{"$f":"'Project Information and TOC'!B4","v":"Project Name: "},{"$f":"IF(ISBLANK('Project Information and TOC'!C4),\"\",'Project Information and TOC'!C4)","v":"Project Name"},null,{"$f":"'Project Information and TOC'!B7","v":"Engineer:"},{"$f":"'Project Information and TOC'!C7","v":"Engineer"}]
[null,{"$f":"'Project Information and TOC'!B5","v":"Date:"},{"$f":"IF(ISBLANK('Project Information and TOC'!C5),\"\",'Project Information and TOC'!C5)","v":"xx/xx/20xx"},null,{"$f":"'Project Information and TOC'!B8","v":"Completion Status:"},{"$f":"'Project Information and TOC'!C8","v":1}]
["General Considerations"]
["Item","Description","Design Stage","Complete?\nYES, NO, N/A","Reviewer Comments","Engineer Responses","Reviewer Follow-Up Comments","Resolved?"]
["Page Numbers","Sequential page numbers shown for each page? (starting at 1 for each section or numbered sequentially through report)"]
["Tables/Graphs/Figures/ Photographs","Numbered sequentially throughout report or within sections?\nGraphs have each axis labeled?\nTables include header and units for each column?"]
["(User Defined Item)"]
["(User Defined Item)"]
["(User Defined Item)"]
{"$rows_left_out":11}
{"sheet":"General & Pertinent Data","index":3,"n_rows":42,"n_cols":9,"rows_kept":42,"cut":false,"hidden":false,"merged":[[3,0,3,8],[27,0,31,0],[37,0,41,0],[32,0,36,0],[22,0,26,0],[15,0,21,0],[5,0,9,0],[10,0,14,0]]}
[null,{"$f":"'Project Information and TOC'!$B3","v":"Dam Name/ID: "},{"$f":"IF(ISBLANK('Project Information and TOC'!C3),\"\",'Project Information and TOC'!C3)","v":"Dam Name"},null,{"$f":"'Project Information and TOC'!B6","v":"Owner:"},{"$f":"'Project Information and TOC'!C6","v":"Dam Owner"}]
[null,{"$f":"'Project Information and TOC'!$B4","v":"Project Name: "},{"$f":"IF(ISBLANK('Project Information and TOC'!C4),\"\",'Project Information and TOC'!C4)","v":"Project Name"},null,{"$f":"'Project Information and TOC'!B7","v":"Engineer:"},{"$f":"'Project Information and TOC'!C7","v":"Engineer"}]
[null,{"$f":"'Project Information and TOC'!$B5","v":"Date:"},{"$f":"IF(ISBLANK('Project Information and TOC'!C5),\"\",'Project Information and TOC'!C5)","v":"xx/xx/20xx"},null,{"$f":"'Project Information and TOC'!B8","v":"Completion Status:"},{"$f":"'Project Information and TOC'!C8","v":1}]
["General & Pertinent Data Review Checklist"]
["Item","Typically Required Report Content","Design Stage","YES, NO, N/A","Reference","Reviewer Comments","Engineer Responses","Reviewer Follow-Up Comments","Resolved?"]
["Cover Page","Project Name?",null,null,"N/A"]
[null,"Dam name and ID (NID and State ID, if available), county, State, water district (if applicable) shown?",null,null,"N/A"]
[null,"Prepared for (dam owner) and prepared by (name of engineering firm) shown?",null,null,"N/A"]
[null,"Report date shown?",null,null,"N/A"]
[null,null,null,null,"N/A"]
{"$rows_left_out":33}
{"sheet":"Hydrology & Hydraulics","index":4,"n_rows":85,"n_cols":9,"rows_kept":85,"cut":false,"hidden":false,"merged":[[80,0,84,0],[37,0,41,0],[70,0,74,0],[75,0,79,0],[3,0,3,8],[5,0,9,0],[10,0,14,0],[15,0,23,0],[24,0,31,0],[32,0,36,0],[47,0,54,0],[55,0,69,0],[42,0,46,0]]}
[null,{"$f":"'Project Information and TOC'!$B3","v":"Dam Name/ID: "},{"$f":"IF(ISBLANK('Project Information and TOC'!C3),\"\",'Project Information and TOC'!C3)","v":"Dam Name"},null,{"$f":"'Project Information and TOC'!B6","v":"Owner:"},{"$f":"'Project Information and TOC'!C6","v":"Dam Owner"}]
[null,{"$f":"'Project Information and TOC'!$B4","v":"Project Name: "},{"$f":"IF(ISBLANK('Project Information and TOC'!C4),\"\",'Project Information and TOC'!C4)","v":"Project Name"},null,{"$f":"'Project Information and TOC'!B7","v":"Engineer:"},{"$f":"'Project Information and TOC'!C7","v":"Engineer"}]
[null,{"$f":"'Project Information and TOC'!$B5","v":"Date:"},{"$f":"IF(ISBLANK('Project Information and TOC'!C5),\"\",'Project Information and TOC'!C5)","v":"xx/xx/20xx"},null,{"$f":"'Project Information and TOC'!B8","v":"Completion Status:"},{"$f":"'Project Information and TOC'!C8","v":1}]
["Hydrology & Hydraulics Review Checklist"]
["Item","Typically Required Report Content","Design Stage","YES, NO, N/A","Reference","Reviewer Comments","Engineer Responses","Reviewer Follow-Up Comments","Resolved?"]
["Available Information/Data","Table of reservoir area and storage capacity for each foot of elevation referenced to NAVD 88.  Elevation of dead storage, outlet invert, spillway(s) and dam crest indicated? ",null,null,"36.14.303 (1)(a)(x)"]
[null,null,null,null,"N/A"]
[null,null,null,null,"N/A"]
[null,null,null,null,"N/A"]
[null,null,null,null,"N/A"]
{"$rows_left_out":76}
{"sheet":"Geology Seismicity Geotechnical","index":5,"n_rows":85,"n_cols":9,"rows_kept":85,"cut":false,"hidden":false,"merged":[[80,0,84,0],[70,0,74,0],[75,0,79,0],[3,0,3,8],[5,0,9,0],[10,0,19,0],[20,0,24,0],[25,0,29,0],[30,0,34,0],[35,0,40,0],[41,0,45,0],[46,0,50,0],[51,0,59,0],[60,0,69,0]]}
[null,{"$f":"'Project Information and TOC'!$B3","v":"Dam Name/ID: "},{"$f":"IF(ISBLANK('Project Information and TOC'!C3),\"\",'Project Information and TOC'!C3)","v":"Dam Name"},null,{"$f":"'Project Information and TOC'!B6","v":"Owner:"},{"$f":"'Project Information and TOC'!C6","v":"Dam Owner"}]
[null,{"$f":"'Project Information and TOC'!$B4","v":"Project Name: "},{"$f":"IF(ISBLANK('Project Information and TOC'!C4),\"\",'Project Information and TOC'!C4)","v":"Project Name"},null,{"$f":"'Project Information and TOC'!B7","v":"Engineer:"},{"$f":"'Project Information and TOC'!C7","v":"Engineer"}]
[null,{"$f":"'Project Information and TOC'!$B5","v":"Date:"},{"$f":"IF(ISBLANK('Project Information and TOC'!C5),\"\",'Project Information and TOC'!C5)","v":"xx/xx/20xx"},null,{"$f":"'Project Information and TOC'!B8","v":"Completion Status:"},{"$f":"'Project Information and TOC'!C8","v":1}]
["Geology, Seismicity, Geotechnical Review Checklist"]
["Item","Typically Required Report Content","Design Stage","YES, NO, N/A","Reference","Reviewer Comments","Engineer Responses","Reviewer Follow-Up Comments","Resolved?"]
["Available Information/Data","Regional geologic setting, local and site geology described (including faults and faulting history)?",null,null,"36.14.306 (1)(b)"]
[null,"Geologic suitability of the dam foundation?",null,null,"N/A"]
[null,"Slide potential of the reservoir rim and abutment areas?",null,null,"36.14.303 (1)(b)(iii)"]
[null,"Seismic history, potential, and design loads provided?",null,null,"36.14.303 (1)(b)(ii)"]
[null,null,null,null,"N/A"]
{"$rows_left_out":76}
{"sheet":"Structural","index":6,"n_rows":32,"n_cols":9,"rows_kept":32,"cut":false,"hidden":false,"merged":[[17,0,21,0],[22,0,26,0],[27,0,31,0],[5,0,9,0],[3,0,3,8],[10,0,16,0]]}
[null,{"$f":"'Project Information and TOC'!$B3","v":"Dam Name/ID: "},{"$f":"IF(ISBLANK('Project Information and TOC'!C3),\"\",'Project Information and TOC'!C3)","v":"Dam Name"},null,{"$f":"'Project Information and TOC'!B6","v":"Owner:"},{"$f":"'Project Information and TOC'!C6","v":"Dam Owner"}]
[null,{"$f":"'Project Information and TOC'!$B4","v":"Project Name: "},{"$f":"IF(ISBLANK('Project Information and TOC'!C4),\"\",'Project Information and TOC'!C4)","v":"Project Name"},null,{"$f":"'Project Information and TOC'!B7","v":"Engineer:"},{"$f":"'Project Information and TOC'!C7","v":"Engineer"}]
[null,{"$f":"'Project Information and TOC'!$B5","v":"Date:"},{"$f":"IF(ISBLANK('Project Information and TOC'!C5),\"\",'Project Information and TOC'!C5)","v":"xx/xx/20xx"},null,{"$f":"'Project Information and TOC'!B8","v":"Completion Status:"},{"$f":"'Project Information and TOC'!C8","v":1}]
["Structural Review Checklist"]
["Item","Typically Required Report Content","Design Stage","YES, NO, N/A","Reference","Reviewer Comments","Engineer Responses","Reviewer Follow-Up Comments","Resolved?"]
["Design Criteria","Concrete structures design guidance and criteria, including loading conditions, identified?",null,null,"N/A"]
[null,"Steel structures design guidance and criteria, including loading conditions, identified?",null,null,"N/A"]
[null,null,null,null,"N/A"]
[null,null,null,null,"N/A"]
[null,null,null,null,"N/A"]
{"$rows_left_out":23}
{"sheet":"Other","index":7,"n_rows":35,"n_cols":9,"rows_kept":35,"cut":false,"hidden":false,"merged":[[30,0,34,0],[25,0,29,0],[3,0,3,8],[5,0,9,0],[10,0,14,0],[15,0,19,0],[20,0,24,0]]}
[null,{"$f":"'Project Information and TOC'!$B3","v":"Dam Name/ID: "},{"$f":"IF(ISBLANK('Project Information and TOC'!C3),\"\",'Project Information and TOC'!C3)","v":"Dam Name"},null,{"$f":"'Project Information and TOC'!B6","v":"Owner:"},{"$f":"'Project Information and TOC'!C6","v":"Dam Owner"}]
[null,{"$f":"'Project Information and TOC'!$B4","v":"Project Name: "},{"$f":"IF(ISBLANK('Project Information and TOC'!C4),\"\",'Project Information and TOC'!C4)","v":"Project Name"},null,{"$f":"'Project Information and TOC'!B7","v":"Engineer:"},{"$f":"'Project Information and TOC'!C7","v":"Engineer"}]
[null,{"$f":"'Project Information and TOC'!$B5","v":"Date:"},{"$f":"IF(ISBLANK('Project Information and TOC'!C5),\"\",'Project Information and TOC'!C5)","v":"xx/xx/20xx"},null,{"$f":"'Project Information and TOC'!B8","v":"Completion Status:"},{"$f":"'Project Information and TOC'!C8","v":1}]
["Other Review Checklist"]
["Item","Typically Required Report Content","Design Stage","YES, NO, N/A","Reference","Reviewer Comments","Engineer Responses","Reviewer Follow-Up Comments","Resolved?"]
["Mechanical","Gate and/or valve design analyses adequate and calculations documented? ",null,null,"N/A"]
[null,null,null,null,"N/A"]
[null,null,null,null,"N/A"]
[null,null,null,null,"N/A"]
[null,null,null,null,"N/A"]
{"$rows_left_out":26}
{"sheet":"Permitting","index":8,"n_rows":30,"n_cols":9,"rows_kept":30,"cut":false,"hidden":false,"merged":[[25,0,29,0],[3,0,3,8],[5,0,9,0],[10,0,14,0],[15,0,19,0],[20,0,24,0]]}
[null,{"$f":"'Project Information and TOC'!$B3","v":"Dam Name/ID: "},{"$f":"IF(ISBLANK('Project Information and TOC'!C3),\"\",'Project Information and TOC'!C3)","v":"Dam Name"},null,{"$f":"'Project Information and TOC'!B6","v":"Owner:"},{"$f":"'Project Information and TOC'!C6","v":"Dam Owner"}]
[null,{"$f":"'Project Information and TOC'!$B4","v":"Project Name: "},{"$f":"IF(ISBLANK('Project Information and TOC'!C4),\"\",'Project Information and TOC'!C4)","v":"Project Name"},null,{"$f":"'Project Information and TOC'!B7","v":"Engineer:"},{"$f":"'Project Information and TOC'!C7","v":"Engineer"}]
[null,{"$f":"'Project Information and TOC'!$B5","v":"Date:"},{"$f":"IF(ISBLANK('Project Information and TOC'!C5),\"\",'Project Information and TOC'!C5)","v":"xx/xx/20xx"},null,{"$f":"'Project Information and TOC'!B8","v":"Completion Status:"},{"$f":"'Project Information and TOC'!C8","v":1}]
["Permitting Review Checklist"]
["Item","Typically Required Report Content","Design Stage","YES, NO, N/A","Reference","Reviewer Comments","Engineer Responses","Reviewer Follow-Up Comments","Resolved?"]
["Permitting","List of required/anticipated permits provided?",null,null,"N/A"]
[null,"Responsible party identified for obtaining permit?",null,null,"N/A"]
[null,"Permit approval/processing time?",null,null,"N/A"]
[null,null,null,null,"N/A"]
[null,null,null,null,"N/A"]
{"$rows_left_out":21}
{"sheet":"Construction","index":9,"n_rows":31,"n_cols":9,"rows_kept":31,"cut":false,"hidden":false,"merged":[[26,0,30,0],[3,0,3,8],[5,0,10,0],[11,0,15,0],[16,0,20,0],[21,0,25,0]]}
[null,{"$f":"'Project Information and TOC'!$B3","v":"Dam Name/ID: "},{"$f":"IF(ISBLANK('Project Information and TOC'!C3),\"\",'Project Information and TOC'!C3)","v":"Dam Name"},null,{"$f":"'Project Information and TOC'!B6","v":"Owner:"},{"$f":"'Project Information and TOC'!C6","v":"Dam Owner"}]
[null,{"$f":"'Project Information and TOC'!$B4","v":"Project Name: "},{"$f":"IF(ISBLANK('Project Information and TOC'!C4),\"\",'Project Information and TOC'!C4)","v":"Project Name"},null,{"$f":"'Project Information and TOC'!B7","v":"Engineer:"},{"$f":"'Project Information and TOC'!C7","v":"Engineer"}]
[null,{"$f":"'Project Information and TOC'!$B5","v":"Date:"},{"$f":"IF(ISBLANK('Project Information and TOC'!C5),\"\",'Project Information and TOC'!C5)","v":"xx/xx/20xx"},null,{"$f":"'Project Information and TOC'!B8","v":"Completion Status:"},{"$f":"'Project Information and TOC'!C8","v":1}]
["Construction Review Checklist"]
["Item","Typically Required Report Content","YES, NO, N/A","YES, NO, N/A","Reference","Reviewer Comments","Engineer Responses","Reviewer Follow-Up Comments","Resolved?"]
["Construction Considerations","Reservoir operation during construction (drawdown and refill schedule, stream diversion plan)?",null,null,"36.14.306 (1)(a)(iv)"]
[null,"Site/excavation dewatering plan during construction?",null,null,"36.14.306 (1)(a)(iv)"]
[null,"Seepage control measures to protect the dam during construction?",null,null,"36.14.306 (1)(a)(v)"]
[null,"Quality control plan and responsibility for QC?",null,null,"36.14.303 (1)(f)"]
[null,"Source and suitability of materials from offsite or onsite borrow?",null,null,"N/A"]
{"$rows_left_out":22}
{"sheet":"Project Specific Sections","index":10,"n_rows":26,"n_cols":9,"rows_kept":26,"cut":false,"hidden":false,"merged":[[25,0,29,0],[3,0,3,8],[5,0,9,0],[10,0,14,0],[15,0,19,0],[20,0,24,0]]}
[null,{"$f":"'Project Information and TOC'!$B3","v":"Dam Name/ID: "},{"$f":"IF(ISBLANK('Project Information and TOC'!C3),\"\",'Project Information and TOC'!C3)","v":"Dam Name"},null,{"$f":"'Project Information and TOC'!B6","v":"Owner:"},{"$f":"'Project Information and TOC'!C6","v":"Dam Owner"}]
[null,{"$f":"'Project Information and TOC'!$B4","v":"Project Name: "},{"$f":"IF(ISBLANK('Project Information and TOC'!C4),\"\",'Project Information and TOC'!C4)","v":"Project Name"},null,{"$f":"'Project Information and TOC'!B7","v":"Engineer:"},{"$f":"'Project Information and TOC'!C7","v":"Engineer"}]
[null,{"$f":"'Project Information and TOC'!$B5","v":"Date:"},{"$f":"IF(ISBLANK('Project Information and TOC'!C5),\"\",'Project Information and TOC'!C5)","v":"xx/xx/20xx"},null,{"$f":"'Project Information and TOC'!B8","v":"Completion Status:"},{"$f":"'Project Information and TOC'!C8","v":1}]
["Project Specific Review Checklist"]
["Item","Typically Required Report Content","Design Stage","YES, NO, N/A","Reference","Reviewer Comments","Engineer Responses","Reviewer Follow-Up Comments","Resolved?"]
["(User Defined Item)"]
[]
[]
[]
[]
{"$rows_left_out":17}
{"sheet":"Agency Specific Sections","index":11,"n_rows":26,"n_cols":9,"rows_kept":26,"cut":false,"hidden":false,"merged":[[25,0,29,0],[3,0,3,8],[5,0,9,0],[10,0,14,0],[15,0,19,0],[20,0,24,0]]}
[null,{"$f":"'Project Information and TOC'!$B3","v":"Dam Name/ID: "},{"$f":"IF(ISBLANK('Project Information and TOC'!C3),\"\",'Project Information and TOC'!C3)","v":"Dam Name"},null,{"$f":"'Project Information and TOC'!B6","v":"Owner:"},{"$f":"'Project Information and TOC'!C6","v":"Dam Owner"}]
[null,{"$f":"'Project Information and TOC'!$B4","v":"Project Name: "},{"$f":"IF(ISBLANK('Project Information and TOC'!C4),\"\",'Project Information and TOC'!C4)","v":"Project Name"},null,{"$f":"'Project Information and TOC'!B7","v":"Engineer:"},{"$f":"'Project Information and TOC'!C7","v":"Engineer"}]
[null,{"$f":"'Project Information and TOC'!$B5","v":"Date:"},{"$f":"IF(ISBLANK('Project Information and TOC'!C5),\"\",'Project Information and TOC'!C5)","v":"xx/xx/20xx"},null,{"$f":"'Project Information and TOC'!B8","v":"Completion Status:"},{"$f":"'Project Information and TOC'!C8","v":1}]
["Agency Specific Review Checklist"]
["Item","Typically Required Report Content","Design Stage","YES, NO, N/A","Reference","Reviewer Comments","Engineer Responses","Reviewer Follow-Up Comments","Resolved?"]
["(User Defined Item)"]
[]
[]
[]
[]
{"$rows_left_out":17}
{"sheet":"References","index":12,"n_rows":127,"n_cols":2,"rows_kept":127,"cut":false,"hidden":false,"merged":[[125,0,125,1],[43,0,43,1],[44,0,44,1],[0,0,1,1],[3,0,3,1],[4,0,4,1],[16,0,16,1],[17,0,17,1],[40,0,40,1],[122,0,122,1],[106,0,106,1],[107,0,107,1],[115,0,115,1],[73,0,73,1],[83,0,83,1],[89,0,89,1],[90,0,90,1],[97,0,97,1],[101,0,101,1],[84,0,84,1],[85,0,85,1],[86,0,86,1]]}
[]
[]
[]
["References"]
["ADDITIONAL REFERENCES AND RESOURCES FOR DAM CONSTRUCTION SPECIFICATIONS"]
["NMOSE","New Mexico Office of the State Engineer (2008), Technical Specifications for Dams."]
["MDNR","Montana Department of Natural Resources (2012), Specification Requirements for Dams (Technical Note 8)."]
["CDWR","Colorado Division of Water Resources (2007), Rules and Regulations for Dam Safety and Dam Construction"]
["CDWR","Colorado Division of Water Resources (2014), Project Review Guide."]
["USBR","U.S. Dept. of the Interior, Bureau of Reclamation (1987), Design of Small Dams, 3rd Ed."]
{"$rows_left_out":118}
{"sheet":"Comment Tracking","index":13,"n_rows":23,"n_cols":5,"rows_kept":23,"cut":false,"hidden":true,"merged":[]}
[null,"Design Report Review Toolbox","Version:","01"]
[]
[null,"Comments:","Tool Revision","Date Received","Date Resolved"]
[1,"For comments – change to dnrdamsafety@mt.gov, instead of my email address.","Beta 01","2021-05-26","2021-06-07"]
[2,"I am thinking how to keep the review back and forth comments organized as we review 30%, 60% . 90% etc, without having multiple spreadsheets.  One suggestion that may work:  Add column to left of yes/No NA, maybe in different color with title “Design Stage”; The drop down choices below this new column should include All, NA, 30%, 60%, 90%, 100%, Bid.  We could then remove completion status from project info page and titles on sheets.  This way, there would be three spreadsheets for each permit review (specs, plans, design report), rather than potentially up to 12 different sheets.\n- Hitting N/A would also fill in Design Stage Column.","Beta 01","2021-05-26","2021-06-07"]
[3,"Change the column heading “MT DNRC rules and Regs / Permit #, etc. “  to “Reference”.  Provides more flexibility.","Beta 01","2021-05-26","2021-06-07"]
[4,"Resolved Yes/No drop down doesn’t work ","Beta 01","2021-05-26","2021-06-07"]
[5,"I really like there is lots of extra room to add things unique to project in each section.","Beta 01","2021-05-26","2021-06-07"]
[6,"Hide option box sheet","Beta 01","2021-05-26","2021-06-07"]
[7,"Copy/paste error on several sheets- the title “Typically Required Specification Content” needs to be changed to “Typically Required Report Content”.","Beta 01","2021-05-26","2021-06-07"]
{"$rows_left_out":14}
{"sheet":"OPTIONBOX","index":14,"n_rows":8,"n_cols":3,"rows_kept":8,"cut":false,"hidden":true,"merged":[]}
["Options","Note","Design Stage"]
["Yes","These are used for the data validation drop downs.",0.3]
["No",null,0.6]
["N/A",null,0.9]
[null,null,1]
[null,null,"All"]
[null,null,"N/A"]
[null,null,"Bid"]