{"text_format":"1","workbook":"xlsx","n_sheets":13,"sheets":["README","Project Information and TOC","General Considerations","General Drawings","Civil Drawings","Structural Drawings","Instrumentation Drawings","Miscellaneous Drawings","Project Specific Drawings","Agency Specific Drawings","References","Comment Tracking","OPTIONBOX"],"not_rendered":{"charts":0,"images":5,"macros":1,"external_links":0,"defined_names":24,"comments":0,"pivot_tables":0},"unopened":[],"bounds":{"document_bytes":16777216,"sheet_cells":100000,"rows_first":2000,"rows_last":500,"rows_between":2000,"halvings":0,"cell_chars":16384,"cell_head_chars":4096},"cells_cut":0,"cells_raw":0,"read":"whole","date_system":"1900"}

{"sheet":"README","index":0,"n_rows":28,"n_cols":5,"rows_kept":28,"cut":false,"hidden":false,"merged":[[2,3,3,3],[3,1,8,1]]}
[null,"Construction Plan Review Toolbox","Version:","01"]
[]
[null,"Disclaimer:",null,"Begin"]
[null,"This construction plan review toolbox is for general information only. The intent is to provide a checklist and guidance on some key work items expected to be included in a plan set for dam construction based on the experience of the authors and the review board, comprised of Dam Design Engineers and State Dam Safety Officials, and has been prepared in accordance with generally recognized engineering principles and practices. The toolbox is not intended to be a comprehensive or inclusive list of all items that need to be included in a complete plan set for dam construction. The information presented should not be used without first securing competent advice from qualified professionals with respect to its suitability for any general or specific application.  Regardless of completion of the checklist, generating a complete design, including detailed plan set, remains the responsibility of the responsible Design Engineer.  No reference made in this publication constitutes an endorsement or warranty thereof by AECOM or sponsors of this Toolbox. Anyone using the information presented in this Toolbox assumes all liability arising from such use."]
[]
[null,null,null,"Developed by: ","AECOM-Denver"]
[]
[null,null,null,"Developed using:","Microsoft Excel 365, Version 2008 (Build 13127.21064 Click-to-Run)"]
[]
[]
[null,"Instructions / Guide:"]
[]
[null,"1. Inputs go into cells shaded in this color."]
[null,"2. The \"Project Information and TOC\" tab provides a summary of the spreadsheet content. Project-specific information entered on that tab will be automatically entered in the remaining sheets."]
[null,"3. Following the \"Project Information and TOC\" tab is a tab for \"General Considerations\" that the engineer may wish to consider throughout construction plan development. "]
{"$rows_left_out":14}
{"sheet":"Project Information and TOC","index":1,"n_rows":88,"n_cols":3,"rows_kept":88,"cut":false,"hidden":false,"merged":[[54,1,54,2],[27,1,27,2],[0,0,1,1],[0,4,1,4],[36,1,36,2],[47,1,47,2]]}
[]
[]
[null,"Dam Name/ID: ","Dam Name"]
[null,"Project Name: ","Project Name"]
[null,"Date:","xx/xx/20xx"]
[null,"Owner:","Dam Owner"]
[null,"Engineer:","Engineer"]
[null,"Completion Status:",1]
[null,"Reviewer (s):","Reviewers"]
[null,"Description/Comments:","Version 01 released June 2021"]
[]
[null,"General Considerations","\"General Considerations\" that the engineer may wish to consider throughout construction plan set development"]
[null,{"$f":"'General Considerations'!A6","v":"Drawing Numbers"},{"$f":"HYPERLINK(CONCATENATE(\"#\",\"'\",$B$12,\"'!A\",MATCH(B13,INDIRECT(CONCATENATE(\"'\",$B$12,\"'!A1:A500\")),0)),\"Go to Section\")","v":"Go to Section"}]
[null,{"$f":"'General Considerations'!A7","v":"Drawing Titles"},{"$f":"HYPERLINK(CONCATENATE(\"#\",\"'\",$B$12,\"'!A\",MATCH(B14,INDIRECT(CONCATENATE(\"'\",$B$12,\"'!A1:A500\")),0)),\"Go to Section\")","v":"Go to Section"}]
[null,{"$f":"'General Considerations'!A8","v":"Drawing Scales"},"Go to Section"]
{"$rows_left_out":74}
{"sheet":"General Considerations","index":2,"n_rows":20,"n_cols":8,"rows_kept":20,"cut":false,"hidden":false,"merged":[[3,0,3,7]]}
[null,{"$f":"'Project Information and TOC'!B3","v":"Dam Name/ID: "},null,{"$f":"IF(ISBLANK('Project Information and TOC'!C3),\"\",'Project Information and TOC'!C3)","v":"Dam Name"},{"$f":"'Project Information and TOC'!B6","v":"Owner:"},{"$f":"'Project Information and TOC'!C6","v":"Dam Owner"}]
[null,{"$f":"'Project Information and TOC'!B4","v":"Project Name: "},null,{"$f":"IF(ISBLANK('Project Information and TOC'!C4),\"\",'Project Information and TOC'!C4)","v":"Project Name"},{"$f":"'Project Information and TOC'!B7","v":"Engineer:"},{"$f":"'Project Information and TOC'!C7","v":"Engineer"}]
[null,{"$f":"'Project Information and TOC'!B5","v":"Date:"},null,{"$f":"IF(ISBLANK('Project Information and TOC'!C5),\"\",'Project Information and TOC'!C5)","v":"xx/xx/20xx"},{"$f":"'Project Information and TOC'!B8","v":"Completion Status:"},{"$f":"'Project Information and TOC'!C8","v":1}]
["General Considerations"]
["Item","Description","Design Stage","Complete?\nYES, NO, N/A","Reviewer Comments","Engineer Responses","Reviewer Follow-Up Comments","Resolved?"]
["Drawing Numbers","Sequential drawing numbers shown for each sheet and total number of sheets included with each sheet?"]
["Drawing Titles","Dam and project name shown on each sheet? Separate titles for each sheet, figure and plan view?"]
["Drawing Scales","Scales provided in bar format so they can be scaled if not printed to scale? Separate horizontal and vertical scales provided where applicable?"]
["North Arrow","All plan views include North arrow?"]
["Contour Interval","Contour interval 1-foot or scaled relative to overall project dimensions?"]
["Plan Views","Reservoir shown at top of view (water \"flow\" from top to bottom ?)"]
["Profiles and Cross Sections","Profiles and cross sections show reservoir at left side of view (water \"flow\" from left to right)?"]
["Graphs and Profiles","Graphs/profiles have each axis labeled and scale(s) provided?"]
["Tables","Tables include header and units for each column?"]
["Notes","Notes with specification information need to be removed or not in conflict with project specifications?"]
{"$rows_left_out":6}
{"sheet":"General Drawings","index":3,"n_rows":45,"n_cols":9,"rows_kept":45,"cut":false,"hidden":false,"merged":[[12,0,19,0],[5,0,11,0],[3,0,3,8],[30,0,34,0],[40,0,44,0],[35,0,39,0],[25,0,29,0],[20,0,24,0]]}
[null,{"$f":"'Project Information and TOC'!$B3","v":"Dam Name/ID: "},null,{"$f":"IF(ISBLANK('Project Information and TOC'!C3),\"\",'Project Information and TOC'!C3)","v":"Dam Name"},{"$f":"'Project Information and TOC'!B6","v":"Owner:"},{"$f":"'Project Information and TOC'!C6","v":"Dam Owner"}]
[null,{"$f":"'Project Information and TOC'!$B4","v":"Project Name: "},null,{"$f":"IF(ISBLANK('Project Information and TOC'!C4),\"\",'Project Information and TOC'!C4)","v":"Project Name"},{"$f":"'Project Information and TOC'!B7","v":"Engineer:"},{"$f":"'Project Information and TOC'!C7","v":"Engineer"}]
[null,{"$f":"'Project Information and TOC'!$B5","v":"Date:"},null,{"$f":"IF(ISBLANK('Project Information and TOC'!C5),\"\",'Project Information and TOC'!C5)","v":"xx/xx/20xx"},{"$f":"'Project Information and TOC'!B8","v":"Completion Status:"},{"$f":"'Project Information and TOC'!C8","v":1}]
["General Drawings Review Checklist"]
["Item","Typically Required Drawing Content","Design Stage","YES, NO, N/A","Reference","Reviewer Comments","Engineer Responses","Reviewer Follow-Up Comments","Resolved?"]
["Cover Sheet","Project Name?",null,null,"36.14.306 (1)(b)(i)"]
[null,"Dam name and ID (NID and State ID, if available), county, State,  water district (if applicable) shown?",null,null,"N/A"]
[null,"Prepared for (dam owner) and prepared by (name of engineering firm) shown?",null,null,"36.14.306 (1)(b)(i)"]
[null,"Drawing date shown?",null,null,"N/A"]
[null,"List of drawings and drawing numbers match numbers on sheets?",null,null,"36.14.306 (1)(b)(i)"]
[null,"State, vicinity, and location maps, including designated access to the site, location with respect to highways, roads, streams, major population center, and dam(s) that are affected by the project?",null,null,"36.14.306 (1)(b)"]
[null,"Certification by design engineer and owner?",null,null,"36.14.306 (1)(b)(i)"]
["Existing Conditions - Dam and Reservoir Plan View","Stage-storage curve and table, covering bottom of reservoir to top of dam crest, invert of low-level oultet and spillway(s) included?  Dimensions in acres for area and acre-feet for storage?",null,null,"36.14.306 (1)(b)"]
[null,"High and/or normal waterline contour shown?",null,null,"N/A"]
[null,"Site access shown? Access roads and gates/access restrictions shown?",null,null,"N/A"]
{"$rows_left_out":31}
{"sheet":"Civil Drawings","index":4,"n_rows":56,"n_cols":9,"rows_kept":56,"cut":false,"hidden":false,"merged":[[33,0,40,0],[46,0,50,0],[41,0,45,0],[51,0,55,0],[3,0,3,8],[5,0,9,0],[10,0,14,0],[15,0,19,0],[20,0,24,0],[25,0,32,0]]}
[null,{"$f":"'Project Information and TOC'!$B3","v":"Dam Name/ID: "},{"$f":"IF(ISBLANK('Project Information and TOC'!C3),\"\",'Project Information and TOC'!C3)","v":"Dam Name"},null,{"$f":"'Project Information and TOC'!B6","v":"Owner:"},{"$f":"'Project Information and TOC'!C6","v":"Dam Owner"}]
[null,{"$f":"'Project Information and TOC'!$B4","v":"Project Name: "},{"$f":"IF(ISBLANK('Project Information and TOC'!C4),\"\",'Project Information and TOC'!C4)","v":"Project Name"},null,{"$f":"'Project Information and TOC'!B7","v":"Engineer:"},{"$f":"'Project Information and TOC'!C7","v":"Engineer"}]
[null,{"$f":"'Project Information and TOC'!$B5","v":"Date:"},{"$f":"IF(ISBLANK('Project Information and TOC'!C5),\"\",'Project Information and TOC'!C5)","v":"xx/xx/20xx"},null,{"$f":"'Project Information and TOC'!B8","v":"Completion Status:"},{"$f":"'Project Information and TOC'!C8","v":1}]
["Civil Drawings Review Checklist"]
["Item","Typically Required Drawing Content","Design Stage","YES, NO, N/A","Reference","Reviewer Comments","Engineer Responses","Reviewer Follow-Up Comments","Resolved?"]
["Plan View of Modifications","Plan view includes footprint of dam and delineation of proposed modifications?",null,null,"36.14.306 (1)(b)"]
[null,"All major modification features called out and reference to additional drawings with more details provided?",null,null,"N/A"]
[null,"Dam centerline stationing shown?",null,null,"N/A"]
[null,null,null,null,"N/A"]
[null,null,null,null,"N/A"]
["Stream Diversion / Cofferdam","Plan view and sufficient profile/cross section and detail provided for diversion/detention system?",null,null,"36.14.306 (1)(b)"]
[null,"Level of protection shown (estimated expected water elevation for flood level)?",null,null,"N/A"]
[null,"Conduits and control features called out and sized adequately?",null,null,"N/A"]
[null,"Sequence of diversion outlined in notes?",null,null,"N/A"]
[null,null,null,null,"N/A"]
{"$rows_left_out":42}
{"sheet":"Structural Drawings","index":5,"n_rows":30,"n_cols":9,"rows_kept":30,"cut":false,"hidden":false,"merged":[[20,0,24,0],[25,0,29,0],[3,0,3,8],[5,0,9,0],[10,0,14,0],[15,0,19,0]]}
[null,{"$f":"'Project Information and TOC'!$B3","v":"Dam Name/ID: "},{"$f":"IF(ISBLANK('Project Information and TOC'!C3),\"\",'Project Information and TOC'!C3)","v":"Dam Name"},null,{"$f":"'Project Information and TOC'!B6","v":"Owner:"},{"$f":"'Project Information and TOC'!C6","v":"Dam Owner"}]
[null,{"$f":"'Project Information and TOC'!$B4","v":"Project Name: "},{"$f":"IF(ISBLANK('Project Information and TOC'!C4),\"\",'Project Information and TOC'!C4)","v":"Project Name"},null,{"$f":"'Project Information and TOC'!B7","v":"Engineer:"},{"$f":"'Project Information and TOC'!C7","v":"Engineer"}]
[null,{"$f":"'Project Information and TOC'!$B5","v":"Date:"},{"$f":"IF(ISBLANK('Project Information and TOC'!C5),\"\",'Project Information and TOC'!C5)","v":"xx/xx/20xx"},null,{"$f":"'Project Information and TOC'!B8","v":"Completion Status:"},{"$f":"'Project Information and TOC'!C8","v":1}]
["Structural Drawings Review Checklist"]
["Item","Typically Required Drawing Content","Design Stage","YES, NO, N/A","Reference","Reviewer Comments","Engineer Responses","Reviewer Follow-Up Comments","Resolved?"]
["Structural Notes, Abbreviations & Details","Details showing concrete einforcement?",null,null,"36.14.306 (1)(b)"]
[null,"Notes for reinforcement dimensions, cover, ebent bars, splicing, placing, spacing and standard hooks?",null,null,"N/A"]
[null,"List of abbreviations and submbols used on structural drawings.",null,null,"N/A"]
[null,null,null,null,"N/A"]
[null,null,null,null,"N/A"]
["Concrete Structures","All dimensions shown for each element (length, width, thickness)? ",null,null,"N/A"]
[null,"Top of concrete elevations shown?",null,null,"N/A"]
[null,"Joint locations and types shown?",null,null,"N/A"]
[null,null,null,null,"N/A"]
[null,null,null,null,"N/A"]
{"$rows_left_out":16}
{"sheet":"Instrumentation Drawings","index":6,"n_rows":45,"n_cols":9,"rows_kept":45,"cut":false,"hidden":false,"merged":[[30,0,34,0],[35,0,39,0],[40,0,44,0],[5,0,9,0],[3,0,3,8],[10,0,14,0],[15,0,19,0],[20,0,24,0],[25,0,29,0]]}
[null,{"$f":"'Project Information and TOC'!$B3","v":"Dam Name/ID: "},{"$f":"IF(ISBLANK('Project Information and TOC'!C3),\"\",'Project Information and TOC'!C3)","v":"Dam Name"},null,{"$f":"'Project Information and TOC'!B6","v":"Owner:"},{"$f":"'Project Information and TOC'!C6","v":"Dam Owner"}]
[null,{"$f":"'Project Information and TOC'!$B4","v":"Project Name: "},{"$f":"IF(ISBLANK('Project Information and TOC'!C4),\"\",'Project Information and TOC'!C4)","v":"Project Name"},null,{"$f":"'Project Information and TOC'!B7","v":"Engineer:"},{"$f":"'Project Information and TOC'!C7","v":"Engineer"}]
[null,{"$f":"'Project Information and TOC'!$B5","v":"Date:"},{"$f":"IF(ISBLANK('Project Information and TOC'!C5),\"\",'Project Information and TOC'!C5)","v":"xx/xx/20xx"},null,{"$f":"'Project Information and TOC'!B8","v":"Completion Status:"},{"$f":"'Project Information and TOC'!C8","v":1}]
["Instrumentation Drawings Review Checklist"]
["Item","Typically Required Drawing Content","Design Stage","YES, NO, N/A","Reference","Reviewer Comments","Engineer Responses","Reviewer Follow-Up Comments","Resolved?"]
["Instrumentation Plan","Existing and proposed instrumention locations?",null,null,"36.14.306 (1)(b)"]
[null,"Instrumentation type and name?",null,null,"N/A"]
[null,"Legend with symbols differing for each instrumentation type?",null,null,"N/A"]
[null,"Coordinates and elevations for each instrument (called out individually or combined in table)?",null,null,"N/A"]
[null,null,null,null,"N/A"]
["Staff Gages","Located to be legible and visible from safe location (i.e. abutment(s))?",null,null,"N/A"]
[null,"Gage marked each foot and graduated in 10th of feet? ",null,null,"N/A"]
[null,"Gage markings matching true survey elevations? ",null,null,"N/A"]
[null,"Gage extends above EAP trigger elevations?",null,null,"N/A"]
[null,"Gage mounted to limit ice or flood damage?",null,null,"N/A"]
{"$rows_left_out":31}
{"sheet":"Miscellaneous Drawings","index":7,"n_rows":26,"n_cols":9,"rows_kept":26,"cut":false,"hidden":false,"merged":[[25,0,29,0],[3,0,3,8],[5,0,9,0],[10,0,14,0],[15,0,19,0],[20,0,24,0]]}
[null,{"$f":"'Project Information and TOC'!$B3","v":"Dam Name/ID: "},{"$f":"IF(ISBLANK('Project Information and TOC'!C3),\"\",'Project Information and TOC'!C3)","v":"Dam Name"},null,{"$f":"'Project Information and TOC'!B6","v":"Owner:"},{"$f":"'Project Information and TOC'!C6","v":"Dam Owner"}]
[null,{"$f":"'Project Information and TOC'!$B4","v":"Project Name: "},{"$f":"IF(ISBLANK('Project Information and TOC'!C4),\"\",'Project Information and TOC'!C4)","v":"Project Name"},null,{"$f":"'Project Information and TOC'!B7","v":"Engineer:"},{"$f":"'Project Information and TOC'!C7","v":"Engineer"}]
[null,{"$f":"'Project Information and TOC'!$B5","v":"Date:"},{"$f":"IF(ISBLANK('Project Information and TOC'!C5),\"\",'Project Information and TOC'!C5)","v":"xx/xx/20xx"},null,{"$f":"'Project Information and TOC'!B8","v":"Completion Status:"},{"$f":"'Project Information and TOC'!C8","v":1}]
["Miscellaneous Drawings Review Checklist"]
["Item","Typically Required Drawing Content","Design Stage","YES, NO, N/A","Reference","Reviewer Comments","Engineer Responses","Reviewer Follow-Up Comments","Resolved?"]
["(User Defined Item)"]
[]
[]
[]
[]
["(User Defined Item)"]
[]
[]
[]
[]
{"$rows_left_out":12}
{"sheet":"Project Specific Drawings","index":8,"n_rows":26,"n_cols":9,"rows_kept":26,"cut":false,"hidden":false,"merged":[[25,0,29,0],[3,0,3,8],[5,0,9,0],[10,0,14,0],[15,0,19,0],[20,0,24,0]]}
[null,{"$f":"'Project Information and TOC'!$B3","v":"Dam Name/ID: "},{"$f":"IF(ISBLANK('Project Information and TOC'!C3),\"\",'Project Information and TOC'!C3)","v":"Dam Name"},null,{"$f":"'Project Information and TOC'!B6","v":"Owner:"},{"$f":"'Project Information and TOC'!C6","v":"Dam Owner"}]
[null,{"$f":"'Project Information and TOC'!$B4","v":"Project Name: "},{"$f":"IF(ISBLANK('Project Information and TOC'!C4),\"\",'Project Information and TOC'!C4)","v":"Project Name"},null,{"$f":"'Project Information and TOC'!B7","v":"Engineer:"},{"$f":"'Project Information and TOC'!C7","v":"Engineer"}]
[null,{"$f":"'Project Information and TOC'!$B5","v":"Date:"},{"$f":"IF(ISBLANK('Project Information and TOC'!C5),\"\",'Project Information and TOC'!C5)","v":"xx/xx/20xx"},null,{"$f":"'Project Information and TOC'!B8","v":"Completion Status:"},{"$f":"'Project Information and TOC'!C8","v":1}]
["Project Specific Drawings Review Checklist"]
["Item","Typically Required Drawing Content","Design Stage","YES, NO, N/A","Reference","Reviewer Comments","Engineer Responses","Reviewer Follow-Up Comments","Resolved?"]
["(User Defined Item)"]
[]
[]
[]
[]
["(User Defined Item)"]
[]
[]
[]
[]
{"$rows_left_out":12}
{"sheet":"Agency Specific Drawings","index":9,"n_rows":26,"n_cols":9,"rows_kept":26,"cut":false,"hidden":false,"merged":[[25,0,29,0],[3,0,3,8],[5,0,9,0],[10,0,14,0],[15,0,19,0],[20,0,24,0]]}
[null,{"$f":"'Project Information and TOC'!$B3","v":"Dam Name/ID: "},{"$f":"IF(ISBLANK('Project Information and TOC'!C3),\"\",'Project Information and TOC'!C3)","v":"Dam Name"},null,{"$f":"'Project Information and TOC'!B6","v":"Owner:"},{"$f":"'Project Information and TOC'!C6","v":"Dam Owner"}]
[null,{"$f":"'Project Information and TOC'!$B4","v":"Project Name: "},{"$f":"IF(ISBLANK('Project Information and TOC'!C4),\"\",'Project Information and TOC'!C4)","v":"Project Name"},null,{"$f":"'Project Information and TOC'!B7","v":"Engineer:"},{"$f":"'Project Information and TOC'!C7","v":"Engineer"}]
[null,{"$f":"'Project Information and TOC'!$B5","v":"Date:"},{"$f":"IF(ISBLANK('Project Information and TOC'!C5),\"\",'Project Information and TOC'!C5)","v":"xx/xx/20xx"},null,{"$f":"'Project Information and TOC'!B8","v":"Completion Status:"},{"$f":"'Project Information and TOC'!C8","v":1}]
["Agency Specific Drawings Review Checklist"]
["Item","Typically Required Drawing Content","Design Stage","YES, NO, N/A","Reference","Reviewer Comments","Engineer Responses","Reviewer Follow-Up Comments","Resolved?"]
["(User Defined Item)"]
[]
[]
[]
[]
["(User Defined Item)"]
[]
[]
[]
[]
{"$rows_left_out":12}
{"sheet":"References","index":10,"n_rows":123,"n_cols":2,"rows_kept":123,"cut":false,"hidden":false,"merged":[[86,0,86,1],[93,0,93,1],[97,0,97,1],[80,0,80,1],[81,0,81,1],[82,0,82,1],[121,0,121,1],[39,0,39,1],[40,0,40,1],[0,0,1,1],[3,0,3,1],[4,0,4,1],[12,0,12,1],[13,0,13,1],[36,0,36,1],[118,0,118,1],[102,0,102,1],[103,0,103,1],[111,0,111,1],[69,0,69,1],[79,0,79,1],[85,0,85,1]]}
[]
[]
[]
["References"]
["ADDITIONAL REFERENCES AND RESOURCES FOR DAM CONSTRUCTION DRAWINGS"]
["NMOSE","New Mexico Office of the State Engineer (2008), Construction Drawings for Dams."]
["NMOSE","New Mexico Office of the State Engineer (2015), Project Submittal Checklist for Dams - Construction Drawings & Specifications"]
["MDNR","Montana Department of Natural Resources (2019), Design Review Process Manual for Dam Projects."]
["CDWR","Colorado Division of Water Resources (2019), Rules and Regulations for Dam Safety and Dam Construction"]
["CDWR","Colorado Division of Water Resources (2014), Project Review Guide."]
["USBR","U.S. Dept. of the Interior, Bureau of Reclamation (1987), Design of Small Dams, 3rd Ed."]
[]
["EARTHWORK"]
["American Society for Testing and Materials International (ASTM)"]
["ASTM C 33","Standard Specification for Concrete Aggregates."]
{"$rows_left_out":109}
{"sheet":"Comment Tracking","index":11,"n_rows":23,"n_cols":5,"rows_kept":23,"cut":false,"hidden":true,"merged":[]}
[null,"Construction Plan Review Toolbox","Version:","01"]
[]
[null,"Comments:","Tool Revision","Date Received","Date Resolved"]
[1,"For comments – change to dnrdamsafety@mt.gov, instead of my email address.","Beta 01","2021-05-26","2021-06-07"]
[2,"I am thinking how to keep the review back and forth comments organized as we review 30%, 60% . 90% etc, without having multiple spreadsheets.  One suggestion that may work:  Add column to left of yes/No NA, maybe in different color with title “Design Stage”; The drop down choices below this new column should include All, NA, 30%, 60%, 90%, 100%, Bid.  We could then remove completion status from project info page and titles on sheets.  This way, there would be three spreadsheets for each permit review (specs, plans, design report), rather than potentially up to 12 different sheets.\n- Hitting N/A would also fill in Design Stage Column.","Beta 01","2021-05-26","2021-06-07"]
[3,"Change the column heading “MT DNRC rules and Regs / Permit #, etc. “  to “Reference”.  Provides more flexibility.","Beta 01","2021-05-26","2021-06-07"]
[4,"Resolved Yes/No drop down doesn’t work ","Beta 01","2021-05-26","2021-06-07"]
[5,"I really like there is lots of extra room to add things unique to project in each section.","Beta 01","2021-05-26","2021-06-07"]
[6,"Hide option box sheet","Beta 01","2021-05-26","2021-06-07"]
[7,"General Considerations - Yes/no/Na drop down doesn’t work.","Beta 01","2021-05-26","2021-06-07"]
[8,"Copy/paste error on several sheets - the title “Typical Required Specification Content” needs to be changed to “Typically Required Drawing Content”","Beta 01","2021-05-26","2021-06-07"]
[9]
[10]
[11]
[12]
{"$rows_left_out":9}
{"sheet":"OPTIONBOX","index":12,"n_rows":8,"n_cols":3,"rows_kept":8,"cut":false,"hidden":true,"merged":[]}
["Options","Note","Design Stage"]
["Yes","These are used for the data validation drop downs.",0.3]
["No",null,0.6]
["N/A",null,0.9]
[null,null,1]
[null,null,"All"]
[null,null,"N/A"]
[null,null,"Bid"]