{"text_format":"1","workbook":"xlsx","n_sheets":17,"sheets":["README","Project Information and TOC","General Considerations","Div 1 General Requirements","Div 2 Foundation Preparation","Div 2 Earthwork","Div 2 Drainage Pipe","Div 2 Water Control","Div 2 Steel Pipe","Div 2 Cured-In-Place Pipe","Div 3 Concrete","Div 3 RCPP","Project Specific Items","Agency Specific Items","References","Comment Tracking","OPTIONBOX"],"not_rendered":{"charts":0,"images":50,"macros":1,"external_links":0,"defined_names":16,"comments":0,"pivot_tables":0},"unopened":[],"bounds":{"document_bytes":16777216,"sheet_cells":100000,"rows_first":2000,"rows_last":500,"rows_between":2000,"halvings":0,"cell_chars":16384,"cell_head_chars":4096},"cells_cut":0,"cells_raw":0,"read":"whole","date_system":"1900"}

{"sheet":"README","index":0,"n_rows":30,"n_cols":5,"rows_kept":30,"cut":false,"hidden":false,"merged":[[2,3,3,3],[3,1,8,1]]}
[null,"Specification Review Toolbox","Version:","02"]
[]
[null,"Disclaimer:",null,"Begin"]
[null,"This specification toolbox is for general information only. The intent is to provide a checklist and guidance on some key work items expected to be included in a specification package for  dam construction, based on the experience of the authors and the review board, comprised of Dam Design Engineers and State Dam Safety Officials and has been prepared in accordance with generally recognized engineering principles and practices. The toolbox is not intended to be a comprehensive or inclusive list of all items that need to be included in a complete specification package for dam construction. The information presented should not be used without first securing competent advice from qualified professionals with respect to its suitability for any general or specific application.  Regardless of completion of the checklist, generating a complete design, including detailed specifications, remains the responsibility of the responsible Design Engineer.  No reference made in this publication constitutes an endorsement or warranty thereof by AECOM or sponsors of this Toolbox. Anyone using the information presented in this Toolbox assumes all liability arising from such use."]
[]
[null,null,null,"Developed by: ","AECOM-Denver"]
{"$rows_left_out":25}
{"sheet":"Project Information and TOC","index":1,"n_rows":122,"n_cols":3,"rows_kept":122,"cut":false,"hidden":false,"merged":[[27,1,27,2],[0,0,1,1],[0,4,1,4]]}
[]
[]
[null,"Dam Name/ID: ","Dam Name"]
[null,"Project Name: ","Project Name"]
[null,"Date:","xx/xx/20xx"]
[null,"Owner:","Dam Owner"]
{"$rows_left_out":117}
{"sheet":"General Considerations","index":2,"n_rows":20,"n_cols":8,"rows_kept":20,"cut":false,"hidden":false,"merged":[[3,0,3,7]]}
[null,{"$f":"'Project Information and TOC'!B3","v":"Dam Name/ID: "},null,{"$f":"IF(ISBLANK('Project Information and TOC'!C3),\"\",'Project Information and TOC'!C3)","v":"Dam Name"},{"$f":"'Project Information and TOC'!B6","v":"Owner:"},{"$f":"'Project Information and TOC'!C6","v":"Dam Owner"}]
[null,{"$f":"'Project Information and TOC'!B4","v":"Project Name: "},null,{"$f":"IF(ISBLANK('Project Information and TOC'!C4),\"\",'Project Information and TOC'!C4)","v":"Project Name"},{"$f":"'Project Information and TOC'!B7","v":"Engineer:"},{"$f":"'Project Information and TOC'!C7","v":"Engineer"}]
[null,{"$f":"'Project Information and TOC'!B5","v":"Date:"},null,{"$f":"IF(ISBLANK('Project Information and TOC'!C5),\"\",'Project Information and TOC'!C5)","v":"xx/xx/20xx"},{"$f":"'Project Information and TOC'!B8","v":"Completion Status:"},{"$f":"'Project Information and TOC'!C8","v":1}]
["General Considerations"]
["Item","Description","Design Stage","Complete?\nYES, NO, N/A","Reviewer Comments","Engineer Responses","Reviewer Follow-Up Comments","Resolved?"]
["Spec/Drawing Link","Use terms in Specifications, including material names and designations, that are consistent with Drawings.  "]
{"$rows_left_out":15}
{"sheet":"Div 1 General Requirements","index":3,"n_rows":46,"n_cols":9,"rows_kept":46,"cut":false,"hidden":false,"merged":[[42,0,44,0],[45,0,47,0],[3,0,3,8],[27,0,30,0],[31,0,35,0],[36,0,38,0],[39,0,40,0],[6,0,10,0],[11,0,13,0],[14,0,18,0],[19,0,20,0],[21,0,26,0]]}
[null,{"$f":"'Project Information and TOC'!B3","v":"Dam Name/ID: "},{"$f":"IF(ISBLANK('Project Information and TOC'!C3),\"\",'Project Information and TOC'!C3)","v":"Dam Name"},null,{"$f":"'Project Information and TOC'!B6","v":"Owner:"},{"$f":"'Project Information and TOC'!C6","v":"Dam Owner"}]
[null,{"$f":"'Project Information and TOC'!B4","v":"Project Name: "},{"$f":"IF(ISBLANK('Project Information and TOC'!C4),\"\",'Project Information and TOC'!C4)","v":"Project Name"},null,{"$f":"'Project Information and TOC'!B7","v":"Engineer:"},{"$f":"'Project Information and TOC'!C7","v":"Engineer"}]
[null,{"$f":"'Project Information and TOC'!B5","v":"Date:"},{"$f":"IF(ISBLANK('Project Information and TOC'!C5),\"\",'Project Information and TOC'!C5)","v":"xx/xx/20xx"},null,{"$f":"'Project Information and TOC'!B8","v":"Completion Status:"},{"$f":"'Project Information and TOC'!C8","v":1}]
["Division 1 - General Requirements"]
["Item","Typically Required Specification Content","Design Stage","YES, NO, N/A","Typical Considerations and Specification Examples","Reviewer Comments","Engineer Responses","Reviewer Follow-Up Comments","Resolved?"]
["General Requirements"]
{"$rows_left_out":41}
{"sheet":"Div 2 Foundation Preparation","index":4,"n_rows":51,"n_cols":10,"rows_kept":51,"cut":false,"hidden":false,"merged":[[3,0,3,9],[6,0,29,0],[30,0,41,0],[42,0,53,0]]}
[null,{"$f":"'Project Information and TOC'!B3","v":"Dam Name/ID: "},{"$f":"IF(ISBLANK('Project Information and TOC'!C3),\"\",'Project Information and TOC'!C3)","v":"Dam Name"},null,{"$f":"'Project Information and TOC'!B6","v":"Owner:"},{"$f":"'Project Information and TOC'!C6","v":"Dam Owner"},null,null,null,{"$f":"IF(ISBLANK('Project Information and TOC'!D6),\"\",'Project Information and TOC'!D6)","v":""}]
[null,{"$f":"'Project Information and TOC'!B4","v":"Project Name: "},{"$f":"IF(ISBLANK('Project Information and TOC'!C4),\"\",'Project Information and TOC'!C4)","v":"Project Name"},null,{"$f":"'Project Information and TOC'!B7","v":"Engineer:"},{"$f":"'Project Information and TOC'!C7","v":"Engineer"},null,null,null,{"$f":"IF(ISBLANK('Project Information and TOC'!D7),\"\",'Project Information and TOC'!D7)","v":""}]
[null,{"$f":"'Project Information and TOC'!B5","v":"Date:"},{"$f":"IF(ISBLANK('Project Information and TOC'!C5),\"\",'Project Information and TOC'!C5)","v":"xx/xx/20xx"},null,{"$f":"'Project Information and TOC'!B8","v":"Completion Status:"},{"$f":"'Project Information and TOC'!C8","v":1},null,null,null,{"$f":"IF(ISBLANK('Project Information and TOC'!D8),\"\",'Project Information and TOC'!D8)","v":""}]
["Division 2 - Foundation Preparation"]
["Item","Typically Required Specification Content","Design Stage","YES, NO, N/A","Typical Considerations and Specification Examples","Reference","Reviewer Comments","Engineer Responses","Reviewer Follow-Up Comments","Resolved?"]
["Foundation Preparation"]
{"$rows_left_out":46}
{"sheet":"Div 2 Earthwork","index":5,"n_rows":121,"n_cols":10,"rows_kept":121,"cut":false,"hidden":false,"merged":[[103,0,113,0],[114,0,124,0],[70,0,82,0],[83,0,92,0],[93,0,102,0],[6,0,31,0],[32,0,50,0],[51,0,69,0],[3,0,3,9]]}
[null,{"$f":"'Project Information and TOC'!B3","v":"Dam Name/ID: "},{"$f":"IF(ISBLANK('Project Information and TOC'!C3),\"\",'Project Information and TOC'!C3)","v":"Dam Name"},null,{"$f":"'Project Information and TOC'!B6","v":"Owner:"},{"$f":"'Project Information and TOC'!C6","v":"Dam Owner"},null,null,null,{"$f":"IF(ISBLANK('Project Information and TOC'!D6),\"\",'Project Information and TOC'!D6)","v":""}]
[null,{"$f":"'Project Information and TOC'!B4","v":"Project Name: "},{"$f":"IF(ISBLANK('Project Information and TOC'!C4),\"\",'Project Information and TOC'!C4)","v":"Project Name"},null,{"$f":"'Project Information and TOC'!B7","v":"Engineer:"},{"$f":"'Project Information and TOC'!C7","v":"Engineer"},null,null,null,{"$f":"IF(ISBLANK('Project Information and TOC'!D7),\"\",'Project Information and TOC'!D7)","v":""}]
[null,{"$f":"'Project Information and TOC'!B5","v":"Date:"},{"$f":"IF(ISBLANK('Project Information and TOC'!C5),\"\",'Project Information and TOC'!C5)","v":"xx/xx/20xx"},null,{"$f":"'Project Information and TOC'!B8","v":"Completion Status:"},{"$f":"'Project Information and TOC'!C8","v":1},null,null,null,{"$f":"IF(ISBLANK('Project Information and TOC'!D8),\"\",'Project Information and TOC'!D8)","v":""}]
["Division 2 - Earthwork"]
["Item","Typically Required Specification Content","Design Stage","YES, NO, N/A","Typical Considerations and Specification Examples","Reference","Reviewer Comments","Engineer Responses","Reviewer Follow-Up Comments","Resolved?"]
["Earthwork"]
{"$rows_left_out":116}
{"sheet":"Div 2 Drainage Pipe","index":6,"n_rows":29,"n_cols":10,"rows_kept":29,"cut":false,"hidden":false,"merged":[[6,0,12,0],[3,0,3,9],[13,0,22,0],[23,0,32,0]]}
[null,{"$f":"'Project Information and TOC'!B3","v":"Dam Name/ID: "},{"$f":"IF(ISBLANK('Project Information and TOC'!C3),\"\",'Project Information and TOC'!C3)","v":"Dam Name"},null,{"$f":"'Project Information and TOC'!B6","v":"Owner:"},{"$f":"'Project Information and TOC'!C6","v":"Dam Owner"},null,null,null,{"$f":"IF(ISBLANK('Project Information and TOC'!D6),\"\",'Project Information and TOC'!D6)","v":""}]
[null,{"$f":"'Project Information and TOC'!B4","v":"Project Name: "},{"$f":"IF(ISBLANK('Project Information and TOC'!C4),\"\",'Project Information and TOC'!C4)","v":"Project Name"},null,{"$f":"'Project Information and TOC'!B7","v":"Engineer:"},{"$f":"'Project Information and TOC'!C7","v":"Engineer"},null,null,null,{"$f":"IF(ISBLANK('Project Information and TOC'!D7),\"\",'Project Information and TOC'!D7)","v":""}]
[null,{"$f":"'Project Information and TOC'!B5","v":"Date:"},{"$f":"IF(ISBLANK('Project Information and TOC'!C5),\"\",'Project Information and TOC'!C5)","v":"xx/xx/20xx"},null,{"$f":"'Project Information and TOC'!B8","v":"Completion Status:"},{"$f":"'Project Information and TOC'!C8","v":1},null,null,null,{"$f":"IF(ISBLANK('Project Information and TOC'!D8),\"\",'Project Information and TOC'!D8)","v":""}]
["Division 2 - Drainage Pipe"]
["Item","Typically Required Specification Content","Design Stage","YES, NO, N/A","Typical Considerations and Specification Examples","Reference","Reviewer Comments","Engineer Responses","Reviewer Follow-Up Comments","Resolved?"]
["Drainage Pipe"]
{"$rows_left_out":24}
{"sheet":"Div 2 Water Control","index":7,"n_rows":54,"n_cols":10,"rows_kept":54,"cut":false,"hidden":false,"merged":[[48,0,57,0],[6,0,17,0],[18,0,29,0],[30,0,37,0],[3,0,3,9],[38,0,47,0]]}
[null,{"$f":"'Project Information and TOC'!B3","v":"Dam Name/ID: "},{"$f":"IF(ISBLANK('Project Information and TOC'!C3),\"\",'Project Information and TOC'!C3)","v":"Dam Name"},null,{"$f":"'Project Information and TOC'!B6","v":"Owner:"},{"$f":"'Project Information and TOC'!C6","v":"Dam Owner"},null,null,null,{"$f":"IF(ISBLANK('Project Information and TOC'!D6),\"\",'Project Information and TOC'!D6)","v":""}]
[null,{"$f":"'Project Information and TOC'!B4","v":"Project Name: "},{"$f":"IF(ISBLANK('Project Information and TOC'!C4),\"\",'Project Information and TOC'!C4)","v":"Project Name"},null,{"$f":"'Project Information and TOC'!B7","v":"Engineer:"},{"$f":"'Project Information and TOC'!C7","v":"Engineer"},null,null,null,{"$f":"IF(ISBLANK('Project Information and TOC'!D7),\"\",'Project Information and TOC'!D7)","v":""}]
[null,{"$f":"'Project Information and TOC'!B5","v":"Date:"},{"$f":"IF(ISBLANK('Project Information and TOC'!C5),\"\",'Project Information and TOC'!C5)","v":"xx/xx/20xx"},null,{"$f":"'Project Information and TOC'!B8","v":"Completion Status:"},{"$f":"'Project Information and TOC'!C8","v":1},null,null,null,{"$f":"IF(ISBLANK('Project Information and TOC'!D8),\"\",'Project Information and TOC'!D8)","v":""}]
["Division 2 - Water Control"]
["Item","Typically Required Specification Content","Design Stage","YES, NO, N/A","Typical Considerations and Specification Examples","Reference","Reviewer Comments","Engineer Responses","Reviewer Follow-Up Comments","Resolved?"]
["Water Control"]
{"$rows_left_out":49}
{"sheet":"Div 2 Steel Pipe","index":8,"n_rows":44,"n_cols":10,"rows_kept":44,"cut":false,"hidden":false,"merged":[[3,0,3,9],[6,0,27,0],[28,0,37,0],[38,0,47,0]]}
[null,{"$f":"'Project Information and TOC'!B3","v":"Dam Name/ID: "},{"$f":"IF(ISBLANK('Project Information and TOC'!C3),\"\",'Project Information and TOC'!C3)","v":"Dam Name"},null,{"$f":"'Project Information and TOC'!B6","v":"Owner:"},{"$f":"'Project Information and TOC'!C6","v":"Dam Owner"},null,null,null,{"$f":"IF(ISBLANK('Project Information and TOC'!D6),\"\",'Project Information and TOC'!D6)","v":""}]
[null,{"$f":"'Project Information and TOC'!B4","v":"Project Name: "},{"$f":"IF(ISBLANK('Project Information and TOC'!C4),\"\",'Project Information and TOC'!C4)","v":"Project Name"},null,{"$f":"'Project Information and TOC'!B7","v":"Engineer:"},{"$f":"'Project Information and TOC'!C7","v":"Engineer"},null,null,null,{"$f":"IF(ISBLANK('Project Information and TOC'!D7),\"\",'Project Information and TOC'!D7)","v":""}]
[null,{"$f":"'Project Information and TOC'!B5","v":"Date:"},{"$f":"IF(ISBLANK('Project Information and TOC'!C5),\"\",'Project Information and TOC'!C5)","v":"xx/xx/20xx"},null,{"$f":"'Project Information and TOC'!B8","v":"Completion Status:"},{"$f":"'Project Information and TOC'!C8","v":1},null,null,null,{"$f":"IF(ISBLANK('Project Information and TOC'!D8),\"\",'Project Information and TOC'!D8)","v":""}]
["Division 2 - Welded Steel Pipe"]
["Item","Typically Required Specification Content","Design Stage","YES, NO, N/A","Typical Considerations and Specification Examples","Reference","Reviewer Comments","Engineer Responses","Reviewer Follow-Up Comments","Resolved?"]
["Welded Steel Pipe (Outlet Conduits)"]
{"$rows_left_out":39}
{"sheet":"Div 2 Cured-In-Place Pipe","index":9,"n_rows":47,"n_cols":10,"rows_kept":47,"cut":false,"hidden":false,"merged":[[6,0,25,0],[3,0,3,9],[26,0,37,0],[38,0,49,0],[21,4,22,4],[21,1,22,1],[21,2,22,2],[21,5,22,5],[21,6,22,6],[21,9,22,9],[21,3,22,3]]}
[null,{"$f":"'Project Information and TOC'!B3","v":"Dam Name/ID: "},{"$f":"IF(ISBLANK('Project Information and TOC'!C3),\"\",'Project Information and TOC'!C3)","v":"Dam Name"},null,{"$f":"'Project Information and TOC'!B6","v":"Owner:"},{"$f":"'Project Information and TOC'!C6","v":"Dam Owner"},null,null,null,{"$f":"IF(ISBLANK('Project Information and TOC'!D6),\"\",'Project Information and TOC'!D6)","v":""}]
[null,{"$f":"'Project Information and TOC'!B4","v":"Project Name: "},{"$f":"IF(ISBLANK('Project Information and TOC'!C4),\"\",'Project Information and TOC'!C4)","v":"Project Name"},null,{"$f":"'Project Information and TOC'!B7","v":"Engineer:"},{"$f":"'Project Information and TOC'!C7","v":"Engineer"},null,null,null,{"$f":"IF(ISBLANK('Project Information and TOC'!D7),\"\",'Project Information and TOC'!D7)","v":""}]
[null,{"$f":"'Project Information and TOC'!B5","v":"Date:"},{"$f":"IF(ISBLANK('Project Information and TOC'!C5),\"\",'Project Information and TOC'!C5)","v":"xx/xx/20xx"},null,{"$f":"'Project Information and TOC'!B8","v":"Completion Status:"},{"$f":"'Project Information and TOC'!C8","v":1},null,null,null,{"$f":"IF(ISBLANK('Project Information and TOC'!D8),\"\",'Project Information and TOC'!D8)","v":""}]
["Division 2 - Cured-In-Place Pipe"]
["Item","Typically Required Specification Content","Design Stage","YES, NO, N/A","Typical Considerations and Specification Examples","Reference","Reviewer Comments","Engineer Responses","Reviewer Follow-Up Comments","Resolved?"]
["Cured-In-Place Pipe"]
{"$rows_left_out":42}
{"sheet":"Div 3 Concrete","index":10,"n_rows":61,"n_cols":10,"rows_kept":61,"cut":false,"hidden":false,"merged":[[55,0,64,0],[6,0,32,0],[33,0,38,0],[39,0,44,0],[3,0,3,9],[45,0,54,0]]}
[null,{"$f":"'Project Information and TOC'!B3","v":"Dam Name/ID: "},{"$f":"IF(ISBLANK('Project Information and TOC'!C3),\"\",'Project Information and TOC'!C3)","v":"Dam Name"},null,{"$f":"'Project Information and TOC'!B6","v":"Owner:"},{"$f":"'Project Information and TOC'!C6","v":"Dam Owner"},null,null,null,{"$f":"IF(ISBLANK('Project Information and TOC'!D6),\"\",'Project Information and TOC'!D6)","v":""}]
[null,{"$f":"'Project Information and TOC'!B4","v":"Project Name: "},{"$f":"IF(ISBLANK('Project Information and TOC'!C4),\"\",'Project Information and TOC'!C4)","v":"Project Name"},null,{"$f":"'Project Information and TOC'!B7","v":"Engineer:"},{"$f":"'Project Information and TOC'!C7","v":"Engineer"},null,null,null,{"$f":"IF(ISBLANK('Project Information and TOC'!D7),\"\",'Project Information and TOC'!D7)","v":""}]
[null,{"$f":"'Project Information and TOC'!B5","v":"Date:"},{"$f":"IF(ISBLANK('Project Information and TOC'!C5),\"\",'Project Information and TOC'!C5)","v":"xx/xx/20xx"},null,{"$f":"'Project Information and TOC'!B8","v":"Completion Status:"},{"$f":"'Project Information and TOC'!C8","v":1},null,null,null,{"$f":"IF(ISBLANK('Project Information and TOC'!D8),\"\",'Project Information and TOC'!D8)","v":""}]
["Division 3 - Concrete"]
["Item","Typically Required Specification Content","Design Stage","YES, NO, N/A","Typical Considerations and Specification Examples","Reference","Reviewer Comments","Engineer Responses","Reviewer Follow-Up Comments","Resolved?"]
["Concrete"]
{"$rows_left_out":56}
{"sheet":"Div 3 RCPP","index":11,"n_rows":35,"n_cols":10,"rows_kept":35,"cut":false,"hidden":false,"merged":[[6,0,18,0],[19,0,28,0],[29,0,38,0],[3,0,3,9]]}
[null,{"$f":"'Project Information and TOC'!B3","v":"Dam Name/ID: "},{"$f":"IF(ISBLANK('Project Information and TOC'!C3),\"\",'Project Information and TOC'!C3)","v":"Dam Name"},null,{"$f":"'Project Information and TOC'!B6","v":"Owner:"},{"$f":"'Project Information and TOC'!C6","v":"Dam Owner"},null,null,null,{"$f":"IF(ISBLANK('Project Information and TOC'!D6),\"\",'Project Information and TOC'!D6)","v":""}]
[null,{"$f":"'Project Information and TOC'!B4","v":"Project Name: "},{"$f":"IF(ISBLANK('Project Information and TOC'!C4),\"\",'Project Information and TOC'!C4)","v":"Project Name"},null,{"$f":"'Project Information and TOC'!B7","v":"Engineer:"},{"$f":"'Project Information and TOC'!C7","v":"Engineer"},null,null,null,{"$f":"IF(ISBLANK('Project Information and TOC'!D7),\"\",'Project Information and TOC'!D7)","v":""}]
[null,{"$f":"'Project Information and TOC'!B5","v":"Date:"},{"$f":"IF(ISBLANK('Project Information and TOC'!C5),\"\",'Project Information and TOC'!C5)","v":"xx/xx/20xx"},null,{"$f":"'Project Information and TOC'!B8","v":"Completion Status:"},{"$f":"'Project Information and TOC'!C8","v":1},null,null,null,{"$f":"IF(ISBLANK('Project Information and TOC'!D8),\"\",'Project Information and TOC'!D8)","v":""}]
["Division 3 - Reinforced Concrete Pressure Pipe"]
["Item","Typically Required Specification Content","Design Stage","YES, NO, N/A","Typical Considerations and Specification Examples","Reference","Reviewer Comments","Engineer Responses","Reviewer Follow-Up Comments","Resolved?"]
["Reinforced Concrete Pressure Pipe"]
{"$rows_left_out":30}
{"sheet":"Project Specific Items","index":12,"n_rows":15,"n_cols":10,"rows_kept":15,"cut":false,"hidden":false,"merged":[[3,0,3,9]]}
[null,{"$f":"'Project Information and TOC'!B3","v":"Dam Name/ID: "},{"$f":"IF(ISBLANK('Project Information and TOC'!C3),\"\",'Project Information and TOC'!C3)","v":"Dam Name"},null,{"$f":"'Project Information and TOC'!B6","v":"Owner:"},{"$f":"'Project Information and TOC'!C6","v":"Dam Owner"},null,null,null,{"$f":"CONCATENATE('Project Information and TOC'!D6)","v":""}]
[null,{"$f":"'Project Information and TOC'!B4","v":"Project Name: "},{"$f":"IF(ISBLANK('Project Information and TOC'!C4),\"\",'Project Information and TOC'!C4)","v":"Project Name"},null,{"$f":"'Project Information and TOC'!B7","v":"Engineer:"},{"$f":"'Project Information and TOC'!C7","v":"Engineer"},null,null,null,{"$f":"CONCATENATE('Project Information and TOC'!D7)","v":""}]
[null,{"$f":"'Project Information and TOC'!B5","v":"Date:"},{"$f":"IF(ISBLANK('Project Information and TOC'!C5),\"\",'Project Information and TOC'!C5)","v":"xx/xx/20xx"},null,{"$f":"'Project Information and TOC'!B8","v":"Completion Status:"},{"$f":"'Project Information and TOC'!C8","v":1},null,null,null,{"$f":"CONCATENATE('Project Information and TOC'!D8)","v":""}]
["Project Specific Items"]
["Item","Typically Required Specification Content","Design Stage","YES, NO, N/A","Typical Considerations and Specification Examples","Reference","Reviewer Comments","Engineer Responses","Reviewer Follow-Up Comments","Resolved?"]
["(User Defined Item)"]
{"$rows_left_out":10}
{"sheet":"Agency Specific Items","index":13,"n_rows":15,"n_cols":10,"rows_kept":15,"cut":false,"hidden":false,"merged":[[3,0,3,9]]}
[null,{"$f":"'Project Information and TOC'!B3","v":"Dam Name/ID: "},{"$f":"IF(ISBLANK('Project Information and TOC'!C3),\"\",'Project Information and TOC'!C3)","v":"Dam Name"},null,{"$f":"'Project Information and TOC'!B6","v":"Owner:"},{"$f":"'Project Information and TOC'!C6","v":"Dam Owner"},null,null,null,{"$f":"CONCATENATE('Project Information and TOC'!D6)","v":""}]
[null,{"$f":"'Project Information and TOC'!B4","v":"Project Name: "},{"$f":"IF(ISBLANK('Project Information and TOC'!C4),\"\",'Project Information and TOC'!C4)","v":"Project Name"},null,{"$f":"'Project Information and TOC'!B7","v":"Engineer:"},{"$f":"'Project Information and TOC'!C7","v":"Engineer"},null,null,null,{"$f":"CONCATENATE('Project Information and TOC'!D7)","v":""}]
[null,{"$f":"'Project Information and TOC'!B5","v":"Date:"},{"$f":"IF(ISBLANK('Project Information and TOC'!C5),\"\",'Project Information and TOC'!C5)","v":"xx/xx/20xx"},null,{"$f":"'Project Information and TOC'!B8","v":"Completion Status:"},{"$f":"'Project Information and TOC'!C8","v":1},null,null,null,{"$f":"CONCATENATE('Project Information and TOC'!D8)","v":""}]
["Agency Specific Items"]
["Item","Typically Required Specification Content","Design Stage","YES, NO, N/A","Typical Considerations and Specification Examples","Reference","Reviewer Comments","Engineer Responses","Reviewer Follow-Up Comments","Resolved?"]
["(User Defined Item)"]
{"$rows_left_out":10}
{"sheet":"References","index":14,"n_rows":127,"n_cols":2,"rows_kept":127,"cut":false,"hidden":false,"merged":[[90,0,90,1],[97,0,97,1],[101,0,101,1],[84,0,84,1],[85,0,85,1],[86,0,86,1],[125,0,125,1],[43,0,43,1],[44,0,44,1],[0,0,1,1],[3,0,3,1],[4,0,4,1],[16,0,16,1],[17,0,17,1],[40,0,40,1],[122,0,122,1],[106,0,106,1],[107,0,107,1],[115,0,115,1],[73,0,73,1],[83,0,83,1],[89,0,89,1]]}
[]
[]
[]
["References"]
["ADDITIONAL REFERENCES AND RESOURCES FOR DAM CONSTRUCTION SPECIFICATIONS"]
["NMOSE","New Mexico Office of the State Engineer (2008), Technical Specifications for Dams."]
{"$rows_left_out":122}
{"sheet":"Comment Tracking","index":15,"n_rows":34,"n_cols":5,"rows_kept":34,"cut":false,"hidden":true,"merged":[]}
[null,"Specification Review Toolbox","Version:","02"]
[]
[]
[null,"Comments:","Tool Revision","Date Received","Date Resolved"]
[1,"Would be nice to summarize all the Yes/No/NA answers at the end along with comments specific to that item so that they could easily be exported to a comment letter or similar"]
[2,"The comment fields should allow to 'wrap text' so that additional information could be entered and easily displayed.  The  row heights will need to be able to go larger if necessary to facilitate this. (July 2016)"]
{"$rows_left_out":29}
{"sheet":"OPTIONBOX","index":16,"n_rows":8,"n_cols":3,"rows_kept":8,"cut":false,"hidden":true,"merged":[]}
["Options","Note","Design Stage"]
["Yes","These are used for the data validation drop downs.",0.3]
["No",null,0.6]
["N/A",null,0.9]
[null,null,1]
[null,null,"All"]
{"$rows_left_out":2}